WinRM(Windows Remote Management)
type: Concept
definition: 標準プロトコルWS-ManagementのMicrosoft実装で、既定でHTTP 5985番・HTTPS 5986番ポートを使うリモート管理の土台。
alternative label: Windows Remote Management
alternative label: WS-Management
narrower: enable-psremoting
narrower: trustedhosts
narrower: winrm-https-listener
narrower: test-wsman
configured by: winrm-https-listener
subject of: article