CreateFileMapping/MapViewOfFile
type: Concept
definition: Windowsで名前付き共有メモリを作成・オープンし、プロセスのアドレス空間にマップするAPIの組み合わせ。pagefile-backedに使うとディスク非連携の共有メモリになる。
alternative label: CreateFileMappingW
alternative label: OpenFileMapping
broader: shared-memory
uses: memory-mapped-file
incompatible with: remote-machine-sharing
subject of: article