ASP.NET Web Forms
type: Concept
definition: 画面をPage/UserControl/ViewStateで構成する.NET Frameworkの古いWeb UIモデル。ASP.NET Coreとは同じapp modelではない。
alternative label: Web Forms
broader: asp-net-framework
subject of: article