UnmanagedCallersOnly属性
type: Concept
definition: static メソッドに付与すると、そのメソッドをネイティブコードから直接呼び出せるCのエントリポイントとして公開できる.NETの属性。
alternative label: UnmanagedCallersOnlyAttribute
broader: native-aot
requires: blittable-type
requires: c-abi
subject of: article
recommended for: callback-pointer-gc-crash