UAC(ユーザーアカウント制御)
type: Concept
definition: 管理者レベルのアクセス許可が必要な変更を行う瞬間に同意を求め、プロセスがどのアクセストークンで動作するかを制御するWindowsのセキュリティ機能である。
alternative label: User Account Control
narrower: integrity-level
narrower: runas-verb
narrower: installer-detection
narrower: file-registry-virtualization
narrower: administrator-protection
uses: integrity-level
subject of: article