TPM 2.0
type: Concept
definition: 複数の暗号アルゴリズムに対応し(暗号アジリティ)、ISO/IEC 11889:2015として国際標準化されたTPM仕様。Windows 11の要件で、ネイティブUEFI構成を前提としレガシー/CSMモードでは動作しない。
broader: tpm
incompatible with: csm-legacy-bios
uses: tpm-lockout
subject of: article