TGT(チケット許可チケット)
type: Concept
definition: AS交換でKDCが発行する、krbtgtアカウントの長期鍵で暗号化されたチケット。クライアントは中身を読めず、TGS交換でサービスチケットを要求する際に提示する。
alternative label: Ticket Granting Ticket
broader: kerberos
subject of: article