標準システム(Standard)
type: Concept
definition: Arm Cortex-Aなどのアプリケーションプロセッサ向けの、最小128 MiBメモリから動作するOpenHarmonyの基本システムタイプ。完全なアプリケーションフレームワークを持ち、カーネルはLinux。
alternative label: Standard System
broader: openharmony
uses: linux-kernel
subject of: article