sha256crypt
type: Concept
definition: crypt(3)系の$5$という接頭辞を持つ、SHA-256を反復適用するUnix系パスワードハッシュ形式。
alternative label: $5$形式
broader: modular-crypt-format
uses: crypt-3-function
uses: sha-256
verified by: openssl-passwd
subject of: article