Select-String
type: Concept
definition: テキストやファイルの中から正規表現または単純一致でパターンを検索し、前後行も表示できるPowerShellのコマンドレット。
alternative label: -Context
alternative label: -SimpleMatch
broader: powershell
subject of: article
uses: regular-expression