Securityイベントログ
type: Concept
definition: 監査ポリシーで有効にした事象が記録されるWindowsのイベントログ。最大サイズと保持モードを持つ有限の器。
broader: windows-event-log
configured by: event-log-retention-mode
configured by: wevtutil
verified by: get-winevent
verified by: audit-trail-tampering-events
subject of: article