Pythonのsecretsモジュール
type: Concept
definition: Pythonでセキュリティ用途の乱数(トークンなど)を安全に生成するための標準ライブラリモジュール。公式ドキュメントは秘密の管理にはrandomより優先して使うよう案内している。
alternative label: secrets
broader: csprng-drbg
uses: csprng-drbg
subject of: article