保護オブジェクト(protected object)
type: Concept
definition: procedure・function・entryの3種の操作を通じてのみ内部データへアクセスさせ、排他制御を言語が保証するAda 95で導入された機構。
alternative label: protected type
alternative label: Protected Object
narrower: barrier
subject of: article
requires: ada
prevents: data-race