BUFFER OVERFLOW(Result値)
type: Concept
definition: ProcMonのResult列に出る、呼び出し側が用意したバッファより必要なデータが大きかったために必要サイズを返した、という正常なAPIの往復を示す値。セキュリティ用語のバッファオーバーフロー攻撃とは無関係。
alternative label: BUFFER OVERFLOW
broader: procmon
subject of: article