疑似乱数(PRNG)
type: Concept
definition: seedと内部状態から、決定論的な手順で数列を生成する乱数。同じseedと同じアルゴリズムで同じ回数だけ取り出せば、同じ値列が出る。
alternative label: 擬似乱数
alternative label: pseudorandom number generator
alternative label: 通常のPRNG
narrower: csprng-drbg
not recommended for: security-token-generation
not recommended for: session-id
recommended for: simulation-reproducibility
subject of: article