!pe(PrintExceptionコマンド)
type: Concept
definition: SOS拡張が提供する、現在のスレッドで最後にスローされた例外の型・メッセージ・内部例外・スタックトレースを表示するコマンドである。
alternative label: PrintException
alternative label: !pe -nested
broader: sos-extension
subject of: article