Microsoft Pluton
type: Concept
definition: CPUに統合された、マイクロソフト設計のセキュアな暗号プロセッサ。TPMの機能を提供しつつTPM 2.0仕様の範囲を超えた機能も持ち、ファームウェアをWindows Update経由でも更新できる。
alternative label: Pluton
broader: tpm
uses: tpm-2-0
subject of: article