NTLMv1
type: Concept
definition: NTLMプロトコル群の第1版。Windows 11 バージョン24H2およびWindows Server 2025で削除された。
alternative label: NTLM バージョン1
broader: ntlm
incompatible with: windows-11-24h2
verified by: security-log-auth-package
subject of: article