NTLM
type: Concept
definition: パスワードの一方向ハッシュを使ったチャレンジ/レスポンス方式の認証プロトコル群(LANMAN・NTLMv1・NTLMv2を含む)。相互認証を持たず、サーバーが本物であると仮定できる環境向けに設計されている。
alternative label: NTLM認証
alternative label: Windows Challenge/Response
alternative label: NTLM Security Support Provider
narrower: ntlmv1
narrower: ntlmv2
configured by: restrict-ntlm
may cause: pass-the-hash
subject of: article
uses: ntlmv1
uses: ntlmv2