ネットワークリダイレクター
type: Concept
definition: \Device\Mupという単一のデバイスオブジェクトとして名前空間に存在し、UNCパス(\\server\share)の要求をネットワーク越しに運ぶコンポーネント。
alternative label: \Device\Mup
alternative label: SMBクライアント
broader: device-object
requires: device-object
subject of: article