ミニフィルター
type: Concept
definition: フィルターマネージャー(FltMgr)にpre/postコールバックを登録する方式で動く、現在の標準のファイルシステムフィルタードライバー実装方式。
alternative label: Minifilter
alternative label: ミニフィルタードライバー
broader: filesystem-filter-driver
narrower: antivirus-minifilter
narrower: cloud-filter
implements: filesystem-filter-driver
succeeds: legacy-filter-driver
prevents: load-order-instability
requires: filter-manager
uses: minifilter-callback
uses: fast-io
uses: driver-object
configured by: altitude
verified by: fltmc
subject of: article