MFT(マスターファイルテーブル)
type: Concept
definition: NTFSボリューム上のすべてのファイルについて少なくとも1つのエントリ(ファイルレコード)を持つ、NTFSの中心的な台帳。MFT自身のエントリも含まれる。
alternative label: Master File Table
alternative label: マスターファイルテーブル
broader: ntfs
narrower: mft-record
uses: mft-record
requires: mft-zone
subject of: article