Windows 10 Enterprise LTSC 2021
type: Concept
definition: 機能更新を含まない長期サービスチャネル版のWindows10で、サポートは2027年1月12日までである。
alternative label: Enterprise LTSC 2021
alternative label: 通常版LTSC 2021
broader: windows-10
succeeds: windows-10
subject of: article