Low Resource Simulation
type: Concept
definition: HeapAlloc・CreateFile・CreateEventなどのAPI呼び出しを設定した確率で失敗させる、Application Verifierのfault injection機能である。
alternative label: 低リソースシミュレーション
broader: fault-injection
uses: fault-injection
configured by: application-verifier
subject of: article