リストの列型
type: Concept
definition: 選択肢・ユーザー・日付・数値・はい/いいえ・参照などに型付けされた、SharePointリストの列の種類。
alternative label: 選択肢列
alternative label: ユーザー列
alternative label: 日付列
alternative label: 参照(ルックアップ)列
broader: sharepoint-list
should precede: excel-to-list-import
subject of: article