軽量システム(Mini)
type: Concept
definition: Arm Cortex-Mや32ビットRISC-VなどのMCU向けの、最小128 KiBメモリから動作するOpenHarmonyの基本システムタイプ。カーネルはLiteOS-M。
alternative label: Mini System
alternative label: 軽量システムタイプ
broader: openharmony
incompatible with: windows-iot-enterprise-ltsc
subject of: article
uses: liteos-m