lazy writer(遅延書き込みスレッド)
type: Concept
definition: キャッシュマネージャーが毎秒起動し、最近フラッシュされていないダーティページの一部をディスクへ書き戻すバックグラウンド処理。
alternative label: 遅延書き込みスレッド
alternative label: lazy writing thread
broader: cache-manager
automates: write-behind-caching
mitigates: unflushed-write-loss
subject of: article