ジャンクション(マウントポイント)
type: Concept
definition: ディレクトリを別のローカルボリュームの位置へつなぐ、古参のリパースポイント応用の仕組み。
alternative label: Junction
alternative label: マウントポイント
broader: reparse-point
implements: reparse-point
subject of: article