installer detection(インストーラー検出)
type: Concept
definition: 32bit実行ファイルでrequestedExecutionLevel属性がなく、ファイル名にinstall/setup/updateなどを含む場合などに、Windowsがヒューリスティックにインストーラーと判定して昇格を要求する仕組みである。
alternative label: installer detection technology
broader: uac
incompatible with: requested-execution-level
subject of: article