GetQueuedCompletionStatus
type: Concept
definition: I/O完了ポートのキューから完了パケットを1つ取り出すWin32 API。戻り値がFALSEでもOVERLAPPEDポインターが非NULLなら、失敗したI/Oの完了パケットを取り出せたことを意味する。
alternative label: GQCS
narrower: getqueuedcompletionstatusex
uses: completion-key
requires: overlapped-structure
subject of: article