ファイルシステムフィルタードライバー
type: Concept
definition: ファイルシステム(またはその下のボリューム)に向かう要求を横取りできるオプションのドライバー。要求の記録・監視・データの変更・防止ができる。
alternative label: フィルタードライバー
narrower: legacy-filter-driver
narrower: minifilter
subject of: article