ドライバーオブジェクト
type: Concept
definition: ドライバーのロード時にI/Oマネージャーが作るオブジェクト。要求の種類ごとの処理関数(ディスパッチルーチン)への対応表であるMajorFunction配列を持つ。
alternative label: DRIVER_OBJECT
narrower: filter-driver
uses: dispatch-routine
requires: kernel-mode
subject of: article