DLL(ダイナミックリンクライブラリ)
type: Concept
definition: 実行時に読み込まれ、関数やデータを他のモジュールと共有できるWindowsのバイナリモジュール。
alternative label: Dynamic Link Library
alternative label: 動的リンクライブラリ
narrower: abi
narrower: export-ordinal
narrower: cbsize-convention
uses: abi
uses: export-ordinal
subject of: article