CPU Sets
type: Concept
definition: アプリケーション側がOSの電源管理と協調しながら実行してほしいCPUの希望を柔らかく(soft)伝えるための、アフィニティマスクより新しい仕組み。
alternative label: CPU Sets API
narrower: efficiency-class
uses: efficiency-class
subject of: article
should precede: cpu-affinity