-Authenticationパラメーター
type: Concept
definition: PowerShell 6以降のInvoke-RestMethodで、Basic認証やBearerトークンによる認証をヘッダーの手書きなしで指定できるパラメーター。HTTPS以外での使用は既定で拒否される。
alternative label: -Token
alternative label: Basic
alternative label: Bearer
broader: invoke-restmethod
subject of: article