Argon2
type: Concept
definition: Password Hashing Competitionの優勝アルゴリズムで、Argon2id/Argon2i/Argon2dの3種の変種を持つパスワードハッシュ方式。
alternative label: Argon2id
alternative label: Argon2i
alternative label: Argon2d
broader: phc-string-format
uses: phc-string-format
subject of: article