Application Identityサービス(AppIDSvc)
type: Concept
definition: AppLockerのルール評価を担うWindowsサービス。これが動いていないとAppLockerのポリシーは評価されず、監査モードでもイベントが出ない。
alternative label: AppIDSvc
broader: windows-service
subject of: article