総称サブプログラム(Generic Subprogram)
type: Concept
definition: generic宣言に続けて書くサブプログラムの雛形。具体的な型・値・サブプログラムを渡してインスタンス化するまでは呼び出せない。
alternative label: generic subprogram
alternative label: 総称サブプログラム
broader: ada-generics
subject of: article